# Bugs

**URL:** https://www.finalbuilder.com/forums/c/continua-ci/bugs/10.md?page=8

[Latest](https://www.finalbuilder.com/forums/latest.md) · [Categories](https://www.finalbuilder.com/forums/categories.md) · [Tags](https://www.finalbuilder.com/forums/tags.md)

**Page:** 9

---

## [Comment not added](https://www.finalbuilder.com/forums/t/comment-not-added/6027)

<div class="topic-metadata">

**Author:** [@michael.jelich](https://www.finalbuilder.com/forums/u/michael.jelich)\
**Replies:** 1\
**Last updated:** [February 16, 2016, 12:00pm UTC](https://www.finalbuilder.com/forums/t/comment-not-added/6027 "2016-02-16T12:00:35Z")

</div>

Hi Support Team, My most recent build failed to add a comment without any hint. The comment just was not there even if the log contained the respective entry. As I added the comment later manually I got the message that …

---

## [&#91;1.7.0.108&#93; $Source.MyProject$ is not a git repository](https://www.finalbuilder.com/forums/t/91-1-7-0-108-93-source-myproject-is-not-a-git-repository/6026)

<div class="topic-metadata">

**Author:** [@hyperremix](https://www.finalbuilder.com/forums/u/hyperremix)\
**Replies:** 3\
**Last updated:** [February 1, 2016, 1:30am UTC](https://www.finalbuilder.com/forums/t/91-1-7-0-108-93-source-myproject-is-not-a-git-repository/6026 "2016-02-01T01:30:48Z")

</div>

I am trying to make a build process that increments the build version by 1 in my AssemblyInfo and then pushing that change back to the remote repository. However this is not possible, because git does not recognize the w…

---

## [Single Checkbox prompt variables not working](https://www.finalbuilder.com/forums/t/single-checkbox-prompt-variables-not-working/6024)

<div class="topic-metadata">

**Author:** [@uraabe](https://www.finalbuilder.com/forums/u/uraabe)\
**Replies:** 2\
**Last updated:** [January 15, 2016, 3:25am UTC](https://www.finalbuilder.com/forums/t/single-checkbox-prompt-variables-not-working/6024 "2016-01-15T03:25:11Z")

</div>

Create a new project with default settings. Create a configuration Add a variable named TestVar type Text prompt Single Checkbox and Value unchecked. Create a Log Entry\[Information\] action with Message set…

---

## [Uncommitted changes .. Repository doesn't refresh anymore](https://www.finalbuilder.com/forums/t/uncommitted-changes-repository-doesnt-refresh-anymore/6025)

<div class="topic-metadata">

**Author:** [@christian.leh](https://www.finalbuilder.com/forums/u/christian.leh)\
**Replies:** 3\
**Last updated:** [January 12, 2016, 11:17am UTC](https://www.finalbuilder.com/forums/t/uncommitted-changes-repository-doesnt-refresh-anymore/6025 "2016-01-12T11:17:36Z")

</div>

Since 4 weeks, we get this error frequently (after 2-3 builds) in the repository: Uncommitted changes found after reverting working folder ‘C:\\BuildServer\\Rc\\635142ee’. The following 1 paths are listed as uncommitted: !…

---

## [Subversion repository does not detect externals](https://www.finalbuilder.com/forums/t/subversion-repository-does-not-detect-externals/6023)

<div class="topic-metadata">

**Author:** [@miruna](https://www.finalbuilder.com/forums/u/miruna)\
**Replies:** 1\
**Last updated:** [December 24, 2015, 4:28am UTC](https://www.finalbuilder.com/forums/t/subversion-repository-does-not-detect-externals/6023 "2015-12-24T04:28:03Z")

</div>

Hi, I’m running Continua 1.7.1.84 and I have a Subversion repository set up to detect and checkout externals as well as the second level of externals. It worked the first time I set it up, but it is no longer checking o…

---

## [Shelved tests still cause action to fail](https://www.finalbuilder.com/forums/t/shelved-tests-still-cause-action-to-fail/6022)

<div class="topic-metadata">

**Author:** [@christian.leh](https://www.finalbuilder.com/forums/u/christian.leh)\
**Replies:** 1\
**Last updated:** [December 22, 2015, 6:38am UTC](https://www.finalbuilder.com/forums/t/shelved-tests-still-cause-action-to-fail/6022 "2015-12-22T06:38:47Z")

</div>

We had shelved 13 test for a while now. everythin was fine. now we’ve updated to the lastest version 1.7.1.139 which lets the build fail. I reshelved the tests again (by shelving the whole fixture) but it still causes to…

---

## [Trigger issue on upgrade to Continua 1.7](https://www.finalbuilder.com/forums/t/trigger-issue-on-upgrade-to-continua-1-7/6021)

<div class="topic-metadata">

**Author:** [@miruna](https://www.finalbuilder.com/forums/u/miruna)\
**Replies:** 1\
**Last updated:** [December 21, 2015, 2:08am UTC](https://www.finalbuilder.com/forums/t/trigger-issue-on-upgrade-to-continua-1-7/6021 "2015-12-21T02:08:38Z")

</div>

We have a couple of weekly triggers that are enabled, but haven’t run since 2 weeks ago when we upgraded to Continua 1.7. I’m not seeing anything in the error logs to indicate a problem. Where else would I look to figure…

---

## [Continua 1.7.1.84 wraps variable values in parentheses](https://www.finalbuilder.com/forums/t/continua-1-7-1-84-wraps-variable-values-in-parentheses/6020)

<div class="topic-metadata">

**Author:** [@miruna](https://www.finalbuilder.com/forums/u/miruna)\
**Replies:** 3\
**Last updated:** [December 7, 2015, 2:36am UTC](https://www.finalbuilder.com/forums/t/continua-1-7-1-84-wraps-variable-values-in-parentheses/6020 "2015-12-07T02:36:06Z")

</div>

We’ve upgraded from Continua 1.6 to 1.7.1.84 and all our Powershell actions that were passing in script arguments broke because Continua resolves the variables and passes the values wrapped in parentheses. For ex, $Sour…

---

## [A tiny UI bug?](https://www.finalbuilder.com/forums/t/a-tiny-ui-bug/6019)

<div class="topic-metadata">

**Author:** [@stuy](https://www.finalbuilder.com/forums/u/stuy)\
**Replies:** 1\
**Last updated:** [November 30, 2015, 6:00am UTC](https://www.finalbuilder.com/forums/t/a-tiny-ui-bug/6019 "2015-11-30T06:00:19Z")

</div>

Hi, If you go to the homepage (all configs visible), then trigger a build for a config via the ‘start now’ button, the build info shown in the left hand end of the config pane changes to show the status of the new build…

---

## [Triggering builds by subfolders](https://www.finalbuilder.com/forums/t/triggering-builds-by-subfolders/6018)

<div class="topic-metadata">

**Author:** [@remko.seelig](https://www.finalbuilder.com/forums/u/remko.seelig)\
**Replies:** 3\
**Last updated:** [November 4, 2015, 9:56am UTC](https://www.finalbuilder.com/forums/t/triggering-builds-by-subfolders/6018 "2015-11-04T09:56:11Z")

</div>

Hi, I’ve been trying to create a build configuration that’s triggered only on changes within a subfolder in a TFS repository. I started out with a repository trigger, referencing the entire TFS repository (covered by a s…

---

## [DUnitX failed](https://www.finalbuilder.com/forums/t/dunitx-failed/6017)

<div class="topic-metadata">

**Author:** [@michael.jelich](https://www.finalbuilder.com/forums/u/michael.jelich)\
**Replies:** 1\
**Last updated:** [October 29, 2015, 12:20pm UTC](https://www.finalbuilder.com/forums/t/dunitx-failed/6017 "2015-10-29T12:20:08Z")

</div>

Hi Support Team, after updating the server from 1.7.1.66 to 1.7.1.76 the dUnitX Action fails with the following message: "An error occurred whilst attempting to run DUnitX Action. Exit code: 255. Error text: . " I assume…

---

## [Localhost link in email](https://www.finalbuilder.com/forums/t/localhost-link-in-email/6016)

<div class="topic-metadata">

**Author:** [@zinniker](https://www.finalbuilder.com/forums/u/zinniker)\
**Replies:** 1\
**Last updated:** [October 28, 2015, 8:22am UTC](https://www.finalbuilder.com/forums/t/localhost-link-in-email/6016 "2015-10-28T08:22:38Z")

</div>

I updated Continua 1.7.0.108 =\> 1.7.1.66. I know get a wrong link in my notifications sent by email. The link points to http://localhost/xx. Localhost is useless. The Continua Server Properties (../Administration/ci/coll…

---

## [Unable to pass array string to Powershell script](https://www.finalbuilder.com/forums/t/unable-to-pass-array-string-to-powershell-script/6013)

<div class="topic-metadata">

**Author:** [@mohsen.naghian](https://www.finalbuilder.com/forums/u/mohsen.naghian)\
**Replies:** 4\
**Last updated:** [October 27, 2015, 8:24am UTC](https://www.finalbuilder.com/forums/t/unable-to-pass-array-string-to-powershell-script/6013 "2015-10-27T08:24:41Z")

</div>

Hi, Since we updated our Continua to 1.7.1 (currently using 1.7.1.65), one of our powershell script which is using a parameter as array-string, started to fail. The script except an array of strings as one of its param…

---

## [Setting Continua variables in Finalbuilder strips out backslash](https://www.finalbuilder.com/forums/t/setting-continua-variables-in-finalbuilder-strips-out-backslash/6015)

<div class="topic-metadata">

**Author:** [@jpone](https://www.finalbuilder.com/forums/u/jpone)\
**Replies:** 4\
**Last updated:** [October 27, 2015, 1:03am UTC](https://www.finalbuilder.com/forums/t/setting-continua-variables-in-finalbuilder-strips-out-backslash/6015 "2015-10-27T01:03:41Z")

</div>

Since upgrading to 1.7.157, we’ve had a problem with the “Continua CI - Set Variable” action in Finalbuilder. The variable should be “\\share\\development\\ . . .” This worked as expected prior to 1.7.157. Now it gets set…

---

## [Incompatible configuration blocking all scheduled builds](https://www.finalbuilder.com/forums/t/incompatible-configuration-blocking-all-scheduled-builds/6011)

<div class="topic-metadata">

**Author:** [@remko.seelig](https://www.finalbuilder.com/forums/u/remko.seelig)\
**Replies:** 2\
**Last updated:** [October 26, 2015, 10:24am UTC](https://www.finalbuilder.com/forums/t/incompatible-configuration-blocking-all-scheduled-builds/6011 "2015-10-26T10:24:49Z")

</div>

Hi, it seems that we're experiencing a weird issue where a build started with a configuration that is impossible to build (since none of the agents matches the stage's requirement) blocks all other builds. All other bui…

---

## [Unit Tests issue](https://www.finalbuilder.com/forums/t/unit-tests-issue/6014)

<div class="topic-metadata">

**Author:** [@christian.leh](https://www.finalbuilder.com/forums/u/christian.leh)\
**Replies:** 5\
**Last updated:** [October 26, 2015, 10:24am UTC](https://www.finalbuilder.com/forums/t/unit-tests-issue/6014 "2015-10-26T10:24:00Z")

</div>

I something is committed that will cause a test to fail, everything is ok in the first build. it shows “new failures = 1” and so on. if you commit something else and this test still fails, the build also fails but now th…

---

## [&#91;1.7.0.108&#93; Powerhsell action does not escape brackets in expanded variable arguments](https://www.finalbuilder.com/forums/t/91-1-7-0-108-93-powerhsell-action-does-not-escape-brackets-in-expanded-variable-arguments/5998)

<div class="topic-metadata">

**Author:** [@skermajo](https://www.finalbuilder.com/forums/u/skermajo)\
**Replies:** 2\
**Last updated:** [October 23, 2015, 4:35am UTC](https://www.finalbuilder.com/forums/t/91-1-7-0-108-93-powerhsell-action-does-not-escape-brackets-in-expanded-variable-arguments/5998 "2015-10-23T04:35:29Z")

</div>

When trying to pass agent paths (via query syntax) that contain 'Program Files (x86)' to powershell scripts, I receive the following error: x86 : The term 'x86' is not recognized as the name of a cmdlet, function, scrip…

---

## [Continua CI 1.7.1.57: sometimes client does not follow up on server restart](https://www.finalbuilder.com/forums/t/continua-ci-1-7-1-57-sometimes-client-does-not-follow-up-on-server-restart/6012)

<div class="topic-metadata">

**Author:** [@jeroenp](https://www.finalbuilder.com/forums/u/jeroenp)\
**Replies:** 0\
**Last updated:** [October 22, 2015, 11:11am UTC](https://www.finalbuilder.com/forums/t/continua-ci-1-7-1-57-sometimes-client-does-not-follow-up-on-server-restart/6012 "2015-10-22T11:11:04Z")

</div>

See screenshot: https://www.dropbox.com/s/2xxocp4tg…png?raw=1 Situation: Chrome (x64 on Mac OS X 46.0.2490.71 (Official Build) (64-bit)) having a connection to Continua CI x64 1.7.1.57 before updating to 1.7.1.65. Duri…

---

## [Cannot find my DUnitX fork any more](https://www.finalbuilder.com/forums/t/cannot-find-my-dunitx-fork-any-more/6007)

<div class="topic-metadata">

**Author:** [@jeroenp](https://www.finalbuilder.com/forums/u/jeroenp)\
**Replies:** 3\
**Last updated:** [October 22, 2015, 10:38am UTC](https://www.finalbuilder.com/forums/t/cannot-find-my-dunitx-fork-any-more/6007 "2015-10-22T10:38:15Z")

</div>

I’m seeing this in my logs; the “validate” button on the repo says it’s OK.I’ve not touched the config nor repo for ages (see https://github.com/jpluimers/DUnitX.git). How can I give the .git/gitconfig for that repo? S…

---

## [Continua 1.7.0.108: Finalbuilder cannot fetch from LKSLGitHub Repository any more](https://www.finalbuilder.com/forums/t/continua-1-7-0-108-finalbuilder-cannot-fetch-from-lkslgithub-repository-any-more/6008)

<div class="topic-metadata">

**Author:** [@jeroenp](https://www.finalbuilder.com/forums/u/jeroenp)\
**Replies:** 5\
**Last updated:** [October 22, 2015, 10:37am UTC](https://www.finalbuilder.com/forums/t/continua-1-7-0-108-finalbuilder-cannot-fetch-from-lkslgithub-repository-any-more/6008 "2015-10-22T10:37:03Z")

</div>

Related to https://www.finalbuilder.com/forums/t/cannot-find-my-dunitx-fork-any-more/6007 I'm seeing this in my logs; the "validate" button on the repo says it's OK. I've not touched the config for ages, Simon hasn't up…

---

## [Event log page buttons disappear when last matching search on a page is deleted but more matches are on next pages](https://www.finalbuilder.com/forums/t/event-log-page-buttons-disappear-when-last-matching-search-on-a-page-is-deleted-but-more-matches-are-on-next-pages/6009)

<div class="topic-metadata">

**Author:** [@jeroenp](https://www.finalbuilder.com/forums/u/jeroenp)\
**Replies:** 2\
**Last updated:** [October 19, 2015, 10:46am UTC](https://www.finalbuilder.com/forums/t/event-log-page-buttons-disappear-when-last-matching-search-on-a-page-is-deleted-but-more-matches-are-on-next-pages/6009 "2015-10-19T10:46:03Z")

</div>

When searching the event log (for instance athttps://continuaci.pluimers.com/account/privatemessages for “repository’ system event” or “bitbucket.org:443”) the page number selector disappears when you have deleted the la…

---

## [Deleting a message in the event log will clear your search text](https://www.finalbuilder.com/forums/t/deleting-a-message-in-the-event-log-will-clear-your-search-text/6010)

<div class="topic-metadata">

**Author:** [@jeroenp](https://www.finalbuilder.com/forums/u/jeroenp)\
**Replies:** 2\
**Last updated:** [October 19, 2015, 10:45am UTC](https://www.finalbuilder.com/forums/t/deleting-a-message-in-the-event-log-will-clear-your-search-text/6010 "2015-10-19T10:45:52Z")

</div>

Steps to reproduce: Go to the event log (on my machine: https://continuaci.pluimers.com/account/privatemessages) Enter a search term (for instance 443) Click on any entry After the entry opens: click on th…

---

## [Continua 1.7.0.108 - Error initialise build. Message: Exception: AggregateException with a Exception: NullReferenceException](https://www.finalbuilder.com/forums/t/continua-1-7-0-108-error-initialise-build-message-exception-aggregateexception-with-a-exception-nullreferenceexception/6006)

<div class="topic-metadata">

**Author:** [@jeroenp](https://www.finalbuilder.com/forums/u/jeroenp)\
**Replies:** 2\
**Last updated:** [October 17, 2015, 3:12am UTC](https://www.finalbuilder.com/forums/t/continua-1-7-0-108-error-initialise-build-message-exception-aggregateexception-with-a-exception-nullreferenceexception/6006 "2015-10-17T03:12:31Z")

</div>

I’m seeing this at https://continuaci.pluimers.com/administration/events with Continua 1.7.0.108 (User vparrett has credentials that Vincent knows): Build Manager Error initialise build. Message: Exception: AggregateExce…

---

## [Promote Options window is not ReadOnly](https://www.finalbuilder.com/forums/t/promote-options-window-is-not-readonly/6005)

<div class="topic-metadata">

**Author:** [@michael.jelich](https://www.finalbuilder.com/forums/u/michael.jelich)\
**Replies:** 2\
**Last updated:** [October 16, 2015, 7:32am UTC](https://www.finalbuilder.com/forums/t/promote-options-window-is-not-readonly/6005 "2015-10-16T07:32:02Z")

</div>

Hi Support Team, I just tested the ‘Manual Promotion’ of a stage: My last stage (notify users about the availability of a new build) is manual promoted. This window is not read only; thus I can change several settings …

---

## [Recently Completed Builds is unsorted](https://www.finalbuilder.com/forums/t/recently-completed-builds-is-unsorted/6004)

<div class="topic-metadata">

**Author:** [@michael.jelich](https://www.finalbuilder.com/forums/u/michael.jelich)\
**Replies:** 1\
**Last updated:** [October 16, 2015, 2:23am UTC](https://www.finalbuilder.com/forums/t/recently-completed-builds-is-unsorted/6004 "2015-10-16T02:23:57Z")

</div>

Hi Support Team, after update to the most recent ContinuaCI Version the list of Recently Completed Builds (http://127.0.0.1/.../ci/configurations/view/Build) is no longer sorted. I have a list with - build #0 - build #2 …

---

## [Build Version Link is broken](https://www.finalbuilder.com/forums/t/build-version-link-is-broken/6003)

<div class="topic-metadata">

**Author:** [@finalbuilder](https://www.finalbuilder.com/forums/u/finalbuilder)\
**Replies:** 1\
**Last updated:** [October 15, 2015, 9:06am UTC](https://www.finalbuilder.com/forums/t/build-version-link-is-broken/6003 "2015-10-15T09:06:31Z")

</div>

Hi Support Team, I’ve just upgraded to the new ContinuaCI version. Since that when clicking on the blue version label while build is running (http://127.0.0.1/ci#) nothing happens. Before I was directed to the Build p…

---

## [Multiple CheckBoxes Issue](https://www.finalbuilder.com/forums/t/multiple-checkboxes-issue/6002)

<div class="topic-metadata">

**Author:** [@michael.jelich](https://www.finalbuilder.com/forums/u/michael.jelich)\
**Replies:** 1\
**Last updated:** [October 15, 2015, 8:38am UTC](https://www.finalbuilder.com/forums/t/multiple-checkboxes-issue/6002 "2015-10-15T08:38:09Z")

</div>

Hi Support Team, I have a variable of type “Text”, Prompt Type “Checkbox Select”. In ‘Queue Build’ I can check or uncheck any checkbox bei either click on the square or the text - except the first checkbox: this only …

---

## [Strange parsing of custom log messages](https://www.finalbuilder.com/forums/t/strange-parsing-of-custom-log-messages/6001)

<div class="topic-metadata">

**Author:** [@kay.zumbusch](https://www.finalbuilder.com/forums/u/kay.zumbusch)\
**Replies:** 2\
**Last updated:** [October 14, 2015, 11:38am UTC](https://www.finalbuilder.com/forums/t/strange-parsing-of-custom-log-messages/6001 "2015-10-14T11:38:23Z")

</div>

Hi guys, I just encountered a strange behavior using custom log messages. I wrote a C# console application to set the deploy directory for the binaries created by our CI build. The target directory is \\srv016\\ci\_deploy…

---

## [Multiple problems with new Git repository](https://www.finalbuilder.com/forums/t/multiple-problems-with-new-git-repository/6000)

<div class="topic-metadata">

**Author:** [@kay.zumbusch](https://www.finalbuilder.com/forums/u/kay.zumbusch)\
**Replies:** 2\
**Last updated:** [October 12, 2015, 10:46am UTC](https://www.finalbuilder.com/forums/t/multiple-problems-with-new-git-repository/6000 "2015-10-12T10:46:15Z")

</div>

Hi guys, have many successful years using Subversion we decided to move to Git. Our repositories were converted to a Git repositories and pushed to an on premise installation of GitHub enterprise. Unfortunately Continua…

---

## [FinalBuilder Set Build Status action is ignored in Continua](https://www.finalbuilder.com/forums/t/finalbuilder-set-build-status-action-is-ignored-in-continua/5996)

<div class="topic-metadata">

**Author:** [@miruna](https://www.finalbuilder.com/forums/u/miruna)\
**Replies:** 3\
**Last updated:** [October 6, 2015, 1:20am UTC](https://www.finalbuilder.com/forums/t/finalbuilder-set-build-status-action-is-ignored-in-continua/5996 "2015-10-06T01:20:34Z")

</div>

I’m using Continua 1.6.0.305 and FinalBuilder 7.0.0.3396. My FB script uses a “Continua CI - Set Build Status” action to indicate to Continua when it fails (all errors are handled, so it doesn’t error out, but I still wa…

[Previous page](https://www.finalbuilder.com/forums/c/continua-ci/bugs/10.md?page=7)

[Next page](https://www.finalbuilder.com/forums/c/continua-ci/bugs/10.md?page=9)
